{"text_format":"3","workbook":"xlsx","n_sheets":9,"sheets":["Menu","SlimFix","SlimFix Reno+","SlimFix RenoTwin","calcu","lijst RC"," lijst slimfix","lijst reno","lijst renotwin"],"not_rendered":{"images":8,"defined_names":6,"comments":1},"read":"whole","date_system":"1900"}

{"sheet":"Menu","index":0,"n_rows":9,"n_cols":2,"rows_kept":9}
[]
[null,"Hulpmaterialentool dakelementen"]
[null,"Met behulp van deze tool kunt u bij eenvoudige zadel- of lessenaarsdaken bepalen welke"]
[null,"en hoeveel bevestigers en profielen u nodig heeft bij de verwerking van de diverse types "]
[null,"dakelementen"]
[null,"Bij complexere dakconstructies geven wij u graag een projectspecifiek advies."]
[null,"Stuur hiervoor uw projectgegevens naar info@isobouw.nl"]
[]
[null,"Maak een productkeuze"]

{"sheet":"SlimFix","index":1,"n_rows":78,"n_cols":11,"rows_kept":78,"merged":[[13,3,13,9],[15,1,15,11],[29,3,29,7],[47,3,47,7],[58,1,58,11],[60,5,60,6]]}
[]
[null,"Hulpmaterialentool SlimFix dakelementen"]
[]
[null,"Met behulp van deze tool kunt u bij eenvoudige zadel- of lessenaarsdaken bepalen welke en hoeveel "]
[null,"bevestigers en profielen u nodig heeft bij de verwerking van de diverse types SlimFix dakelementen"]
[null,"Bij complexere dakconstructies geven wij u graag een projectspecifiek advies."]
[null,"Stuur hiervoor uw projectgegevens naar info@isobouw.nl"]
[]
[null,"Product"]
[{"$nulls":9},"Opnieuw selecteren bij typeverandering"]
[null,"Type dakelement",null,"_Type",{"$nulls":3},"RC-waarde",null," "]
[{"$nulls":3},"Voor Solar-elementen verwijzen wij naar de verwerkingsvoorschriften op onze site"]
[]
[null,"Projectnaam (optioneel)"]
[]
[null,"Dakconstructie"]
[]
[]
[]
[{"$nulls":9},"d","dd"]
{"$rows_left_out":53}
{"sheet":"SlimFix Reno+","index":2,"n_rows":67,"n_cols":11,"rows_kept":67,"merged":[[12,3,12,9],[14,1,14,11],[46,1,46,11],[48,5,48,6],[63,6,63,9],[66,1,71,11]]}
[]
[null,"Hulpmaterialentool SlimFix Reno+ elementen"]
[]
[null,"Met behulp van deze tool kunt u bij eenvoudige zadel- of lessenaarsdaken bepalen welke en hoeveel "]
[null,"bevestigers en profielen (optioneel) u nodig heeft bij de verwerking van de  SlimFix Reno+ elementen"]
[null,"Bij complexere dakconstructies geven wij u graag een projectspecifiek advies."]
[null,"Stuur hiervoor uw projectgegevens naar info@isobouw.nl"]
[]
[null,"Product"]
[]
[null,"Type dakelement",null,"SlimFix Reno+",{"$nulls":3},"RC-waarde"]
[]
[null,"Projectnaam (optioneel)"]
[]
[null,"Dakconstructie"]
[]
[]
[]
[{"$nulls":9},"d","dd"]
{"$rows_empty":7}
{"$rows_left_out":42}
{"sheet":"SlimFix RenoTwin","index":3,"n_rows":98,"n_cols":12,"rows_kept":98,"merged":[[15,3,15,9],[17,1,17,11],[63,1,63,11],[65,5,65,6],[94,6,94,9],[97,1,102,11]]}
[]
[null,"Hulpmaterialentool SlimFix RenoTwin elementen"]
[]
[null,"Met behulp van deze tool kunt u bij eenvoudige zadel- of lessenaarsdaken bepalen welke en hoeveel "]
[null,"bevestigers en profielen (optioneel) u nodig heeft bij de verwerking van de  SlimFix RenoTwin elementen"]
[null,"Bij complexere dakconstructies geven wij u graag een projectspecifiek advies."]
[null,"Stuur hiervoor uw projectgegevens naar info@isobouw.nl"]
[]
[null,"Product"]
[]
[null,"Type dakelement",null,"SlimFix RenoTwin",{"$nulls":3},"Type*"]
[{"$nulls":3},"* Dit is de isolatiedikte. De bijbehorende Rc-waarde is mede afhankelijk van de onderconstructie (eventuele aanwezigheid oude "]
[{"$nulls":3},"isolatielaag en aanwezige luchtspouw). Zie hieronder voor de daarbij passende Rc-waarde."]
[{"$nulls":3},"Voor Solar-elementen verwijzen wij naar de verwerkingsvoorschriften op onze site"]
[]
[null,"Projectnaam (optioneel)"]
[]
[null,"Dakconstructie"]
[]
[]
{"$rows_left_out":73}
{"sheet":"calcu","index":4,"n_rows":43,"n_cols":28,"rows_kept":43,"hidden":true,"merged":[[1,0,3,9],[1,12,3,21],[9,2,9,3],[9,14,9,15],[36,0,36,9],[36,12,36,21],[37,0,37,9],[37,12,37,21]]}
[]
["Dakvlak 1",{"$nulls":11},"Dakvlak 2",{"$nulls":10},"Rapport SHR 2023","rekenwaarden afschuifsterkte"]
[{"$nulls":23},"rapp.code: 22.0675","FV,Rd,blijvend  [kN]",null,"FV,Rd,kort [kN]"]
[{"$nulls":23},"2023-08-10","schroef Ø 6","schroef Ø 8","schroef Ø 6","schroef Ø 8"]
[null,"SNEEUW:",null,"NEN-EN 1991-1-3+C1:2011/NB:2011",{"$nulls":9},"SNEEUW:",null,"NEN-EN 1991-1-3+C1:2011/NB:2011",{"$nulls":7},"3 mm sp.pl.",0.36,0.51,0.75,1.04]
["Daktype:","Zadel / lessenaarsdak (sneeuw wordt NIET belet van dak te glijden\";\"sneeuw wordt belet van dak te glijden)",{"$nulls":10},"Daktype:","Zadel / lessenaarsdak (sneeuw wordt NIET belet van dak te glijden\";\"sneeuw wordt belet van dak te glijden)",{"$nulls":9},"8 mm sp.pl.",0.85,1.07,1.75,2.2]
[null,"μ1 =",{"$f":"IF(AND(C11>=0,C11<=30),0.8,IF(AND(C11>30,C11<60),(60-C11)/30*0.8,IF(AND(C11>=60,C11<=90),0,IF(C11>90,\" hoek ???\",IF(C11<0,\" hoek ???\",\" \")))))","v":{"v":0.8,"d":"0.80"}},null,"Ce =",1,"sk50 =",{"$f":"0.7*((1-(H8*SQRT(6)/PI()*(LN(-LN(1-1/50))+0.57222)))/(1+2.5923*H8))","v":{"v":0.7007052261979702,"d":"0.7"}},"kN/m2",{"$nulls":4},"μ1 =",{"$f":"IF(AND(O11>=0,O11<=30),0.8,IF(AND(O11>30,O11<60),(60-O11)/30*0.8,IF(AND(O11>=60,O11<=90),0,IF(O11>90,\" hoek ???\",IF(O11<0,\" hoek ???\",\" \")))))","v":{"v":0.8,"d":"0.80"}},null,"Ce =",1,"sk50 =",{"$f":"0.7*((1-(T8*SQRT(6)/PI()*(LN(-LN(1-1/50))+0.57222)))/(1+2.5923*T8))","v":{"v":0.7007052261979702,"d":"0.7"}},"kN/m2",null,null,"3 mm sp.pl + XT rib",1.15,null,1.72]
[null,"s = μi Ce Ct sk =",{"$f":"C7*F7*F8*H7","v":{"v":0.5605641809583761,"d":"0.56"}},"kN/m2","Ct =",1,"V =",0.8,{"$nulls":5},"s = μi Ce Ct sk =",{"$f":"O7*R7*R8*T7","v":{"v":0.5605641809583761,"d":"0.56"}},"kN/m2","Ct =",1,"V =",0.8,{"$nulls":3},"8 mm sp.pl + XT rib",1.34,null,2.01]
[{"$nulls":5},"NEN-EN 1995-1-1:2005/NB:2011 art.2.3.1.2",{"$nulls":11},"NEN-EN 1995-1-1:2005/NB:2011 art.2.3.1.2"]
[null,"element :",{"$f":"SlimFix!D11&\" \"&SlimFix!J11","v":"_Type  "},null,null,"Belastingsduurklasse",{"$nulls":3},"Belastingsvoorbeelden",{"$nulls":3},"element :",{"$f":"SlimFix!D11&\" \"&SlimFix!J11","v":"_Type  "},null,null,"Belastingsduurklasse",{"$nulls":3},"Belastingsvoorbeelden",null,"NEN-EN 1995-1-1:2005/NB:2011 art.2.3.1.2"]
[null,"dakhelling  α =",{"$f":"SlimFix!D44","v":0},null,null,"blijvend",{"$nulls":3},"eigen gewicht",{"$nulls":3},"dakhelling  α =",{"$f":"SlimFix!$D$57","v":0},null,null,"blijvend",{"$nulls":3},"eigen gewicht",null,"Belastingsduurklasse",{"$nulls":3},"Belastingsvoorbeelden"]
[{"$nulls":5},"Kort",{"$nulls":3},"Sneeuw, wind",{"$nulls":7},"Kort",{"$nulls":3},"Sneeuw, wind",null,"blijvend",{"$nulls":3},"eigen gewicht"]
[{"$nulls":23},"Kort",{"$nulls":3},"Sneeuw, wind"]
[null,"eigen gewicht",{"$f":"VLOOKUP(C10,' lijst slimfix'!C6:E60,3)","v":{"$error":"#N/A"}},"kN/m2",null,{"$f":"SlimFix!D30","v":"1,2 of 3 bouwlagen (ééngezinswoning)"},{"$nulls":7},"eigen gewicht",{"$f":"VLOOKUP(C10,' lijst slimfix'!C6:E60,3)","v":{"$error":"#N/A"}},"kN/m2",null,{"$f":"SlimFix!D48","v":"1,2 of 3 bouwlagen (ééngezinswoning)"}]
[null,"pannen",{"$f":"SlimFix!D41","v":0},"kg/m2","evenwijdig ",{"$nulls":8},"pannen",{"$f":"SlimFix!$D$54","v":0},"kg/m2","evenwijdig "]
[null,"PV opdak",{"$f":"SlimFix!J41","v":0},"kg/m2","aan dakvl.",{"$nulls":3},"F",{"$nulls":4},"PV opdak",{"$f":"SlimFix!$J$54","v":0},"kg/m2","aan dakvl.",{"$nulls":3},"F"]
[null,"tot perm.",{"$f":"SUM(C14:C16)/100","v":{"$error":"#N/A"}},"kN/m2 =",{"$f":"C17*SIN(C11/180*PI())*E19*0.981","v":{"$error":"#N/A"}},"kN/m1   x",{"$f":"E20","v":0},"=",{"$f":"E17*G17","v":{"$error":"#N/A"}},"kN",{"$nulls":3},"tot perm.",{"$f":"SUM(O14:O16)/100","v":{"$error":"#N/A"}},"kN/m2 =",{"$f":"O17*SIN(O11/180*PI())*Q19*0.981","v":{"$error":"#N/A"}},"kN/m1   x",{"$f":"Q20","v":0},"=",{"$f":"Q17*S17","v":{"$error":"#N/A"}},"kN"]
[null,"tot sneeuw",{"$f":"C8","v":{"v":0.5605641809583761,"d":"0.56"}},"kN/m2 =",{"$f":"C18*COS(C11/180*PI())*SIN(C11/180*PI())*E19*0.981","v":{"v":0,"d":"0.00"}},"kN/m1   x",{"$f":"E20","v":0},"=",{"$f":"E18*G18","v":{"v":0,"d":"0.00"}},"kN",{"$nulls":3},"tot sneeuw",{"$f":"O8","v":{"v":0.5605641809583761,"d":"0.56"}},"kN/m2 =",{"$f":"O18*COS(O11/180*PI())*SIN(O11/180*PI())*Q19*0.981","v":{"v":0,"d":"0.00"}},"kN/m1   x",{"$f":"Q20","v":0},"=",{"$f":"Q18*S18","v":{"v":0,"d":"0.00"}},"kN"]
[{"$nulls":3},"elementbreedte =",1.02,"m",{"$nulls":9},"elementbreedte =",1.02,"m"]
[{"$nulls":3},"Daklengte =",{"$f":"SlimFix!J32/1000","v":0},"m",{"$nulls":9},"Daklengte =",{"$f":"SlimFix!J50/1000","v":0},"m"]
{"$rows_left_out":24}
{"sheet":"lijst RC","index":5,"n_rows":10,"n_cols":10,"rows_kept":10,"hidden":true}
[{"$f":"SlimFix!$D$11","v":"_Type"},"SlimFix Spoor","SlimFix-XT 3/3L","SlimFix-XT 3/3R","SlimFix-XT 8/8L","SlimFix-XT 8/8R","SlimFix-XT Passief","SlimFix-XT Passief M","SlimFix-XT Riet","ATTENTIE: type op alfabetische volgorde"]
[{"$f":"IF(HLOOKUP($A$1,B1:I10,2)>0,HLOOKUP($A$1,B1:I10,2),\" \")","v":{"$error":"#N/A"}},2.5,2.5,2.5,2.5,2.5,{"v":9,"d":"9.0"},{"v":8,"d":"8.0"},"2.5+4.0"]
[{"$f":"IF(HLOOKUP($A$1,$B$1:$I$10,3)>0,HLOOKUP($A$1,$B$1:$I$10,3),\" \")","v":{"$error":"#N/A"}},{"v":3,"d":"3.0"},{"v":3,"d":"3.0"},{"v":3,"d":"3.0"},{"v":3,"d":"3.0"},{"v":3,"d":"3.0"},{"v":10,"d":"10.0"},null,"3.0+4.0"]
[{"$f":"IF(HLOOKUP($A$1,$B$1:$I$10,4)>0,HLOOKUP($A$1,$B$1:$I$10,4),\" \")","v":{"$error":"#N/A"}},3.5,3.5,3.5,3.5,3.5,null,null,"3.5+4.0"]
[{"$f":"IF(HLOOKUP($A$1,$B$1:$I$10,5)>0,HLOOKUP($A$1,$B$1:$I$10,5),\" \")","v":{"$error":"#N/A"}},{"v":4,"d":"4.0"},{"v":4,"d":"4.0"},{"v":4,"d":"4.0"},{"v":4,"d":"4.0"},{"v":4,"d":"4.0"},null,null,"4.0+4.0"]
[{"$f":"IF(HLOOKUP($A$1,$B$1:$I$10,6)>0,HLOOKUP($A$1,$B$1:$I$10,6),\" \")","v":{"$error":"#N/A"}},4.5,4.5,4.5,4.5,4.5,null,null,"4.5+4.0"]
[{"$f":"IF(HLOOKUP($A$1,$B$1:$I$10,7)>0,HLOOKUP($A$1,$B$1:$I$10,7),\" \")","v":{"$error":"#N/A"}},{"v":5,"d":"5.0"},{"v":5,"d":"5.0"},{"v":5,"d":"5.0"},{"v":5,"d":"5.0"},{"v":5,"d":"5.0"},null,null,"5.5+4.0"]
[{"$f":"IF(HLOOKUP($A$1,$B$1:$I$10,8)>0,HLOOKUP($A$1,$B$1:$I$10,8),\" \")","v":{"$error":"#N/A"}},5.5,5.5,5.5,5.5,5.5,null,null,"6.3+4.0"]
[{"$f":"IF(HLOOKUP($A$1,$B$1:$I$10,9)>0,HLOOKUP($A$1,$B$1:$I$10,9),\" \")","v":{"$error":"#N/A"}},6.3,6.3,6.3,6.3,6.3]
[{"$f":"IF(HLOOKUP($A$1,$B$1:$I$10,10)>0,HLOOKUP($A$1,$B$1:$I$10,10),\" \")","v":{"$error":"#N/A"}},{"v":7,"d":"7.0"},{"v":7,"d":"7.0"},{"v":7,"d":"7.0"},{"v":7,"d":"7.0"},{"v":7,"d":"7.0"}]

{"sheet":" lijst slimfix","index":6,"n_rows":82,"n_cols":27,"rows_kept":82,"hidden":true,"merged":[[1,0,3,4],[1,17,2,21],[2,5,2,9],[2,10,2,15],[3,10,3,12],[3,17,3,18],[3,19,3,20]]}
[null,null,1,2,3,4,5,6,7,8,9,10,11,12,13,14,15,16,17,18,19,20,21,22,23,24,25]
["Keuzevelden",{"$nulls":16},"AANTAL "]
[{"$nulls":5},"t.p.v. kruising tengel/gording",{"$nulls":4},"afschuifkrachten"]
[{"$nulls":7},"dakvlak 1","dakvlak 2",{"$nulls":4},"dakvlak 1","dakvlak 2",null,null,"Schroef 1",null,"Schroef 2",null,"Volgplaatjes",null,"Lucht. Profielen"]
["type","RC-waarde","samen","beplating","gewicht","type","eenheid/ds","aantal elem","aantal elem","schroef tot",null,"eenheid/ds","dikte schr","aantal/pl","aantal/pl","schroef tot.",null,"type","aantal eenheden","type","aantal eenheden","aantal eenheden",null,"m1",null,"aantal"]
["SlimFix Spoor",2.5,{"$f":"A6&\" \"&B6","v":"SlimFix Spoor 2,5"},null,null,"schroef 160xØ6",100,{"$nulls":3}," ",{"$nulls":6},{"$f":"F6","v":"schroef 160xØ6"},null," "]
["SlimFix Spoor",{"v":3,"d":"3.0"},"SlimFix Spoor 3",null,null,"schroef 160xØ6",100,{"$nulls":3}," ",{"$nulls":6},"schroef 160xØ6",null," "]
["SlimFix Spoor",3.5,"SlimFix Spoor 3,5",null,null,"schroef 180xØ6",100,{"$nulls":3}," ",{"$nulls":6},"schroef 180xØ6",null," "]
["SlimFix Spoor",{"v":4,"d":"4.0"},"SlimFix Spoor 4",null,null,"schroef 200xØ6",100,{"$nulls":3}," ",{"$nulls":6},"schroef 200xØ6",null," "]
["SlimFix Spoor",4.5,"SlimFix Spoor 4,5",null,null,"schroef 220xØ6",100,{"$nulls":3}," ",{"$nulls":6},"schroef 220xØ6",null," "]
["SlimFix Spoor",{"v":5,"d":"5.0"},"SlimFix Spoor 5",null,null,"schroef 240xØ6",100,{"$nulls":3}," ",{"$nulls":6},"schroef 240xØ6",null," "]
["SlimFix Spoor",5.5,"SlimFix Spoor 5,5",null,null,"schroef 260xØ6",100,{"$nulls":3}," ",{"$nulls":6},"schroef 260xØ6",null," "]
["SlimFix Spoor",6.3,"SlimFix Spoor 6,3",null,null,"schroef 280xØ6",100,{"$nulls":3}," ",{"$nulls":6},"schroef 280xØ6",null," "]
["SlimFix Spoor",{"v":7,"d":"7.0"},"SlimFix Spoor 7",null,null,"schroef 300xØ6",100,{"$nulls":3}," ",{"$nulls":6},"schroef 300xØ6",null," "]
["SlimFix-XT 3/3L",2.5,"SlimFix-XT 3/3L 2,5",3,10.1,"Schroef 160xØ6",100,{"$f":"CEILING(SlimFix!$D$32*SlimFix!$J$44/1020,1)","v":0},{"$f":"CEILING(SlimFix!$D$50*SlimFix!$J$57/1020,1)","v":0},{"$f":"((H15*SlimFix!$D$35)+(I15*SlimFix!$D$52))*3","v":0},"Schroef 160xØ6",100,6,{"$f":"IF(calcu!$I$32<=0,0,calcu!$I$32)","v":{"$error":"#N/A"}},{"$f":"IF(OR(I15=0,calcu!$U$32<=0),0,calcu!$U$32)","v":{"$error":"#N/A"}},{"$f":"(H15*N15)+(I15*O15)","v":{"$error":"#N/A"}},null,"Schroef 160xØ6",{"$f":"CEILING((J15+P15)/G15,1)","v":{"$error":"#N/A"}},null,null,{"$f":"CEILING(P15/100,1)","v":{"$error":"#N/A"}},"Luchtdichte afdekprofielen",{"$f":"CEILING((H15*(SlimFix!$J$32/1000))+(I15*(SlimFix!$J$50/1000)),1)","v":0},"Door de tengel t.p.v. elke onderliggende gording/muurplaat:",3,"Tussen de tengels t.p.v. de plaatvaste oplegging/muurplaat:"]
["SlimFix-XT 3/3L",{"v":3,"d":"3.0"},"SlimFix-XT 3/3L 3",3,10.7,"Schroef 180xØ6",100,{"$f":"CEILING(SlimFix!$D$32*SlimFix!$J$44/1020,1)","v":0},{"$f":"CEILING(SlimFix!$D$50*SlimFix!$J$57/1020,1)","v":0},{"$f":"((H16*SlimFix!$D$35)+(I16*SlimFix!$D$52))*3","v":0},"Schroef 180xØ6",100,6,{"$f":"IF(calcu!$I$32<=0,0,calcu!$I$32)","v":{"$error":"#N/A"}},{"$f":"IF(OR(I16=0,calcu!$U$32<=0),0,calcu!$U$32)","v":{"$error":"#N/A"}},{"$error":"#N/A"},null,"Schroef 180xØ6",{"$f":"CEILING((J16+P16)/G16,1)","v":{"$error":"#N/A"}},null,null,{"$error":"#N/A"},"Luchtdichte afdekprofielen",{"$f":"CEILING((H16*(SlimFix!$J$32/1000))+(I16*(SlimFix!$J$50/1000)),1)","v":0},"Door de tengel t.p.v. elke onderliggende gording/muurplaat:",3,"Tussen de tengels t.p.v. de plaatvaste oplegging/muurplaat:"]
["SlimFix-XT 3/3L",3.5,{"$f":"A17&\" \"&B17","v":"SlimFix-XT 3/3L 3,5"},3,11.4,"Schroef 200xØ6",100,{"$f":"CEILING(SlimFix!$D$32*SlimFix!$J$44/1020,1)","v":0},{"$f":"CEILING(SlimFix!$D$50*SlimFix!$J$57/1020,1)","v":0},{"$f":"((H17*SlimFix!$D$35)+(I17*SlimFix!$D$52))*3","v":0},"Schroef 200xØ6",100,6,{"$f":"IF(calcu!$I$32<=0,0,calcu!$I$32)","v":{"$error":"#N/A"}},{"$f":"IF(OR(I17=0,calcu!$U$32<=0),0,calcu!$U$32)","v":{"$error":"#N/A"}},{"$f":"(H17*N17)+(I17*O17)","v":{"$error":"#N/A"}},null,"Schroef 200xØ6",{"$error":"#N/A"},null,null,{"$f":"CEILING(P17/100,1)","v":{"$error":"#N/A"}},"Luchtdichte afdekprofielen",{"$f":"CEILING((H17*(SlimFix!$J$32/1000))+(I17*(SlimFix!$J$50/1000)),1)","v":0},"Door de tengel t.p.v. elke onderliggende gording/muurplaat:",3,"Tussen de tengels t.p.v. de plaatvaste oplegging/muurplaat:"]
["SlimFix-XT 3/3L",{"v":4,"d":"4.0"},"SlimFix-XT 3/3L 4",3,{"v":12,"d":"12.0"},"Schroef 220xØ6",100,{"$f":"CEILING(SlimFix!$D$32*SlimFix!$J$44/1020,1)","v":0},{"$f":"CEILING(SlimFix!$D$50*SlimFix!$J$57/1020,1)","v":0},{"$f":"((H18*SlimFix!$D$35)+(I18*SlimFix!$D$52))*3","v":0},"Schroef 220xØ6",100,6,{"$f":"IF(calcu!$I$32<=0,0,calcu!$I$32)","v":{"$error":"#N/A"}},{"$f":"IF(OR(I18=0,calcu!$U$32<=0),0,calcu!$U$32)","v":{"$error":"#N/A"}},{"$error":"#N/A"},null,"Schroef 220xØ6",{"$error":"#N/A"},null,null,{"$error":"#N/A"},"Luchtdichte afdekprofielen",{"$f":"CEILING((H18*(SlimFix!$J$32/1000))+(I18*(SlimFix!$J$50/1000)),1)","v":0},"Door de tengel t.p.v. elke onderliggende gording/muurplaat:",3,"Tussen de tengels t.p.v. de plaatvaste oplegging/muurplaat:"]
["SlimFix-XT 3/3L",4.5,"SlimFix-XT 3/3L 4,5",3,12.8,"Schroef 240xØ6",100,{"$f":"CEILING(SlimFix!$D$32*SlimFix!$J$44/1020,1)","v":0},{"$f":"CEILING(SlimFix!$D$50*SlimFix!$J$57/1020,1)","v":0},{"$f":"((H19*SlimFix!$D$35)+(I19*SlimFix!$D$52))*3","v":0},"Schroef 240xØ6",100,6,{"$f":"IF(calcu!$I$32<=0,0,calcu!$I$32)","v":{"$error":"#N/A"}},{"$f":"IF(OR(I19=0,calcu!$U$32<=0),0,calcu!$U$32)","v":{"$error":"#N/A"}},{"$error":"#N/A"},null,"Schroef 240xØ6",{"$error":"#N/A"},null,null,{"$error":"#N/A"},"Luchtdichte afdekprofielen",{"$f":"CEILING((H19*(SlimFix!$J$32/1000))+(I19*(SlimFix!$J$50/1000)),1)","v":0},"Door de tengel t.p.v. elke onderliggende gording/muurplaat:",3,"Tussen de tengels t.p.v. de plaatvaste oplegging/muurplaat:"]
["SlimFix-XT 3/3L",{"v":5,"d":"5.0"},"SlimFix-XT 3/3L 5",3,13.4,"Schroef 260xØ6",100,{"$f":"CEILING(SlimFix!$D$32*SlimFix!$J$44/1020,1)","v":0},{"$f":"CEILING(SlimFix!$D$50*SlimFix!$J$57/1020,1)","v":0},{"$f":"((H20*SlimFix!$D$35)+(I20*SlimFix!$D$52))*3","v":0},"Schroef 260xØ6",100,6,{"$f":"IF(calcu!$I$32<=0,0,calcu!$I$32)","v":{"$error":"#N/A"}},{"$f":"IF(OR(I20=0,calcu!$U$32<=0),0,calcu!$U$32)","v":{"$error":"#N/A"}},{"$error":"#N/A"},null,"Schroef 260xØ6",{"$error":"#N/A"},null,null,{"$error":"#N/A"},"Luchtdichte afdekprofielen",{"$f":"CEILING((H20*(SlimFix!$J$32/1000))+(I20*(SlimFix!$J$50/1000)),1)","v":0},"Door de tengel t.p.v. elke onderliggende gording/muurplaat:",3,"Tussen de tengels t.p.v. de plaatvaste oplegging/muurplaat:"]
{"$rows_left_out":63}
{"sheet":"lijst reno","index":7,"n_rows":15,"n_cols":13,"rows_kept":15,"hidden":true,"merged":[[0,0,2,2],[0,3,0,5],[1,3,1,5],[2,3,2,5],[14,0,18,9]]}
["Keuzevelden",null,null,"AANTAL BEVESTIGERS PER PLAAT"]
[]
[{"$nulls":3},"t.p.v. kruising tengel/gording",null,null,"dakvlak 1","dakvlak 2"]
["type","RC-waarde",null,"type","aantal","maat","aantal elem.","aantal elem.","schroef tot.",{"$nulls":3},"type"]
["SlimFix Reno+",2.5,{"$f":"A5&\" \"&B5","v":"SlimFix Reno+ 2,5"},"Schroef",6,"140xØ6",{"$f":"CEILING('SlimFix Reno+'!$D$29*'SlimFix Reno+'!$D$36/1000,1)","v":0},{"$f":"CEILING('SlimFix Reno+'!$D$40*'SlimFix Reno+'!$D$45/1000,1)","v":0},{"$f":"((G5*'SlimFix Reno+'!$D$32)+(H5*'SlimFix Reno+'!$D$42))*3","v":0},{"$nulls":3},{"$f":"'SlimFix Reno+'!D11&\" \"&'SlimFix Reno+'!J11","v":"SlimFix Reno+ "}]
["SlimFix Reno+",{"v":3,"d":"3.0"},{"$f":"A6&\" \"&B6","v":"SlimFix Reno+ 3"},"Schroef",6,"140xØ6",{"$nulls":3},"Horizontale RenoGoot S (1,95 m, RAL 7021)*","Verticale RenoGoot S (1,6 m, RAL 7021)"]
["SlimFix Reno+",3.5,"SlimFix Reno+ 3,5","Schroef",6,"160xØ6",{"$nulls":3},"Horizontale RenoGoot S (1,95 m, RAL 7021)*","Verticale RenoGoot S (1,6 m, RAL 7021)"]
["SlimFix Reno+",{"v":4,"d":"4.0"},"SlimFix Reno+ 4","Schroef",6,"180xØ6",{"$nulls":3},"Horizontale RenoGoot M (1,95 m, RAL 7021)*","Verticale RenoGoot M (1,6 m, RAL 7021)"]
["SlimFix Reno+",4.5,"SlimFix Reno+ 4,5","Schroef",6,"200xØ6",{"$nulls":3},"Horizontale RenoGoot M (1,95 m, RAL 7021)*","Verticale RenoGoot M (1,6 m, RAL 7021)"]
["SlimFix Reno+",{"v":5,"d":"5.0"},"SlimFix Reno+ 5","Schroef",6,"200xØ6",{"$nulls":3},"Horizontale RenoGoot M (1,95 m, RAL 7021)*","Verticale RenoGoot M (1,6 m, RAL 7021)"]
["SlimFix Reno+",6.3,"SlimFix Reno+ 6,3","Schroef",6,"260xØ6",{"$nulls":3},"Horizontale RenoGoot L (1,95 m, RAL 7021)*","Verticale RenoGoot L (1,6 m, RAL 7021)"]
["SlimFix Reno+",{"v":7,"d":"7.0"},"SlimFix Reno+ 7","Schroef",6,"280xØ6",{"$nulls":3},"Horizontale RenoGoot L (1,95 m, RAL 7021)*","Verticale RenoGoot L (1,6 m, RAL 7021)"]
["SlimFix Reno+",{"v":8,"d":"8.0"},"SlimFix Reno+ 8","Schroef",6,"300xØ6",{"$nulls":3},"Horizontale RenoGoot L (1,95 m, RAL 7021)*","Verticale RenoGoot L (1,6 m, RAL 7021)"]
[]
["* Het Horizontale RenoGoot-pakket bevat: 6x Horizontale RenoGoot (bestaande uit een kopplaat en een gootdeel), 14x brackets (ter versteviging\nen koppeling) en 30x RVS-schroeven met verzonken kop Ø4 mm x 32 mm TX.\n** Het Verticale RenoGoot-pakket bevat: 4x Verticale RenoGoot (bestaande uit een verholen goot en een afdekkap), 4x schuimrubberband (1,5 m) en 24x RVS-boorschroeven + rubberring Ø4.8 mm x 32 mm TX.\nAttentie: Bij gebruik van de RenoGoot altijd de SlimFix Reno+ platen met gootdetail bestellen."]

{"sheet":"lijst renotwin","index":8,"n_rows":342,"n_cols":14,"rows_kept":342,"hidden":true,"merged":[[18,0,22,10]]}
["Keuzevelden"]
[]
[{"$nulls":3},"dakvlak 1","dakvlak 2","dakvlak 1","dakvlak 2"]
["type","Type",null,"aantal elem.","aantal elem.","schroef tot.","schroef tot.",{"$nulls":3},"Afstand tussen schroeven in mm bij 67° bevestiging","Benodigde lengte in mm RenoTwin schroef",null,"type"]
["SlimFix RenoTwin",82,{"$f":"A5&\" \"&B5","v":"SlimFix RenoTwin 82"},{"$f":"CEILING('SlimFix RenoTwin'!$D$32*'SlimFix RenoTwin'!$J$42/1000,1)","v":0},{"$f":"CEILING('SlimFix RenoTwin'!$D$51*'SlimFix RenoTwin'!$J$57/1000,1)","v":0},{"$f":"((D5*'SlimFix RenoTwin'!$D$35))*3","v":0},{"$f":"((E5*'SlimFix RenoTwin'!D53))*3","v":0},"Horizontale RenoGoot S (1,95 m, RAL 7021)*","Verticale RenoGoot S (1,6 m, RAL 7021)",null,"(100","8x255",null,{"$f":"'SlimFix RenoTwin'!D11&\" \"&'SlimFix RenoTwin'!J11","v":"SlimFix RenoTwin "}]
["SlimFix RenoTwin",97,"SlimFix RenoTwin 97",{"$nulls":4},"Horizontale RenoGoot S (1,95 m, RAL 7021)*","Verticale RenoGoot S (1,6 m, RAL 7021)",null,"(115","8x275"]
["SlimFix RenoTwin",114,"SlimFix RenoTwin 114",{"$nulls":4},"Horizontale RenoGoot M (1,95 m, RAL 7021)*","Verticale RenoGoot M (1,6 m, RAL 7021)",null,"(125","8x302"]
["SlimFix RenoTwin",129,"SlimFix RenoTwin 129",{"$nulls":4},"Horizontale RenoGoot M (1,95 m, RAL 7021)*","Verticale RenoGoot M (1,6 m, RAL 7021)",null,"(125","8x302"]
["SlimFix RenoTwin",141,"SlimFix RenoTwin 141",{"$nulls":4},"Horizontale RenoGoot L (1,95 m, RAL 7021)*","Verticale RenoGoot L (1,6 m, RAL 7021)",null,"(140","8x335"]
["SlimFix RenoTwin",166,"SlimFix RenoTwin 166",{"$nulls":4},"Horizontale RenoGoot L (1,95 m, RAL 7021)*","Verticale RenoGoot L (1,6 m, RAL 7021)",null,"(140","8x365"]
["SlimFix RenoTwin",180,"SlimFix RenoTwin 180",{"$nulls":4},"Horizontale RenoGoot L (1,95 m, RAL 7021)*","Verticale RenoGoot L (1,6 m, RAL 7021)",null,"(150","8x365"]
["SlimFix RenoTwin",188,{"$f":"A12&\" \"&B12","v":"SlimFix RenoTwin 188"},{"$nulls":4},"Horizontale RenoGoot L (1,95 m, RAL 7021)*","Verticale RenoGoot L (1,6 m, RAL 7021)",null,"(150","8x365"]
["SlimFix RenoTwin",195,"SlimFix RenoTwin 195",{"$nulls":4},"Horizontale RenoGoot L (1,95 m, RAL 7021)*","Verticale RenoGoot L (1,6 m, RAL 7021)",null,"(150","8x365"]
["SlimFix RenoTwin",224,"SlimFix RenoTwin 224",{"$nulls":4},"Horizontale RenoGoot L (1,95 m, RAL 7021)*",null,null,"(160","8x397"]
["SlimFix RenoTwin",258,"SlimFix RenoTwin 258",{"$nulls":7},"(180","8x435"]
[]
[]
[]
["* Het Horizontale RenoGoot-pakket bevat: 6x Horizontale RenoGoot (bestaande uit een kopplaat en een gootdeel), 14x brackets (ter versteviging\nen koppeling) en 30x RVS-schroeven met verzonken kop Ø4 mm x 32 mm TX.\n** Het Verticale RenoGoot-pakket bevat: 4x Verticale RenoGoot (bestaande uit een verholen goot en een afdekkap), 4x schuimrubberband (1,5 m) en 24x RVS-boorschroeven + rubberring Ø4.8 mm x 32 mm TX.\nAttentie: Bij gebruik van de RenoGoot altijd de SlimFix Reno+ platen met gootdetail bestellen."]
{"$rows_empty":7}
{"$rows_left_out":316}